Reaction Details
TargetLysine-specific demethylase 4C
LigandBDBM293675
Substrate/Competitorn/a
Meas. Tech.JMJD2C Assay
Temperature298.15±n/a K
IC50 550±n/a nM
Commentsextracted
Citation Boloor, AChen, YKWallace, MB Histone demethylase inhibitors US Patent US10106534 Publication Date 10/23/2018
 
Lysine-specific demethylase 4C
Name:Lysine-specific demethylase 4C
Type:Protein
Mol. Mass.:119979.01
Organism:Homo sapiens (Human)
Description:Q9H3R0
Residue:1056
BDBM293675
NameBDBM293675
Synonyms:3-({[7-(2,3-dihydro-1H-indol-1-yl)-3,4-dihydro-2H-1-benzopyran- | US10106534, Example 17
TypeSmall organic molecule
Emp. Form.C24H23N3O3
Mol. Mass.401.4577
SMILESOC(=O)c1ccncc1NCC1CCOc2cc(ccc12)N1CCc2ccccc12