Reaction Details
TargetLysine-specific demethylase 4C
LigandBDBM293683
Substrate/Competitorn/a
Meas. Tech.JMJD2C Assay
Temperature298.15±n/a K
IC50 550±n/a nM
Commentsextracted
Citation Boloor, AChen, YKWallace, MB Histone demethylase inhibitors US Patent US10106534 Publication Date 10/23/2018
 
Lysine-specific demethylase 4C
Name:Lysine-specific demethylase 4C
Type:Protein
Mol. Mass.:119979.01
Organism:Homo sapiens (Human)
Description:Q9H3R0
Residue:1056
BDBM293683
NameBDBM293683
Synonyms:3-{[(2-phenyl-5,6,7,8-tetrahydroquinolin-5- | US10106534, Example 25
TypeSmall organic molecule
Emp. Form.C22H21N3O2
Mol. Mass.359.421
SMILESOC(=O)c1ccncc1NCC1CCCc2nc(ccc12)-c1ccccc1