Reaction Details
TargetLysine-specific demethylase 4C
LigandBDBM293690
Substrate/Competitorn/a
Meas. Tech.JMJD2C Assay
Temperature298.15±n/a K
IC50 550±n/a nM
Commentsextracted
Citation Boloor, AChen, YKWallace, MB Histone demethylase inhibitors US Patent US10106534 Publication Date 10/23/2018
 
Lysine-specific demethylase 4C
Name:Lysine-specific demethylase 4C
Type:Protein
Mol. Mass.:119979.01
Organism:Homo sapiens (Human)
Description:Q9H3R0
Residue:1056
BDBM293690
NameBDBM293690
Synonyms:3-({[(4R)-7-(4-methylphenyl)-3,4-dihydro-2H-1-benzopyran-4- | US10106534, Example 32
TypeSmall organic molecule
Emp. Form.C23H22N2O3
Mol. Mass.374.4324
SMILESCc1ccc(cc1)-c1ccc2[C@H](CNc3cnccc3C(O)=O)CCOc2c1