Reaction Details
TargetLysine-specific demethylase 6B
LigandBDBM293695
Substrate/Competitorn/a
Meas. Tech.JMJD3 Assay
Temperature298.15±n/a K
IC50 5500±n/a nM
Commentsextracted
Citation Boloor, AChen, YKWallace, MB Histone demethylase inhibitors US Patent US10106534 Publication Date 10/23/2018
 
Lysine-specific demethylase 6B
Name:Lysine-specific demethylase 6B
Type:Protein
Mol. Mass.:176672.55
Organism:Homo sapiens (Human)
Description:O15054
Residue:1643
BDBM293695
NameBDBM293695
Synonyms:3-({[(4R)-7-(2-methylthiophen-3-yl)-3,4-dihydro-2H-1- | US10106534, Example 37
TypeSmall organic molecule
Emp. Form.C21H20N2O3S
Mol. Mass.380.46
SMILESCc1sccc1-c1ccc2[C@H](CNc3cnccc3C(O)=O)CCOc2c1