Reaction Details
TargetLysine-specific demethylase 6B
LigandBDBM293697
Substrate/Competitorn/a
Meas. Tech.JMJD3 Assay
Temperature298.15±n/a K
IC50 550±n/a nM
Commentsextracted
Citation Boloor, AChen, YKWallace, MB Histone demethylase inhibitors US Patent US10106534 Publication Date 10/23/2018
 
Lysine-specific demethylase 6B
Name:Lysine-specific demethylase 6B
Type:Protein
Mol. Mass.:176672.55
Organism:Homo sapiens (Human)
Description:O15054
Residue:1643
BDBM293697
NameBDBM293697
Synonyms:3-({[(4S)-7-(2-chlorophenyl)-3,4-dihydro-2H-1-benzopyran-4- | US10106534, Example 39
TypeSmall organic molecule
Emp. Form.C22H19ClN2O3
Mol. Mass.394.851
SMILESOC(=O)c1ccncc1NC[C@H]1CCOc2cc(ccc12)-c1ccccc1Cl