Reaction Details
TargetLysine-specific demethylase 4C
LigandBDBM293710
Substrate/Competitorn/a
Meas. Tech.JMJD2C Assay
Temperature298.15±n/a K
IC50 5500±n/a nM
Commentsextracted
Citation Boloor, AChen, YKWallace, MB Histone demethylase inhibitors US Patent US10106534 Publication Date 10/23/2018
 
Lysine-specific demethylase 4C
Name:Lysine-specific demethylase 4C
Type:Protein
Mol. Mass.:119979.01
Organism:Homo sapiens (Human)
Description:Q9H3R0
Residue:1056
BDBM293710
NameBDBM293710
Synonyms:3-({[(4S)-7-[(3-fluorophenyl)sulfanyl]-3,4-dihydro-2H-1- | US10106534, Example 52
TypeSmall organic molecule
Emp. Form.C22H19FN2O3S
Mol. Mass.410.461
SMILESOC(=O)c1ccncc1NC[C@H]1CCOc2cc(Sc3cccc(F)c3)ccc12