Reaction Details
TargetLysine-specific demethylase 6B
LigandBDBM293843
Substrate/Competitorn/a
Meas. Tech.JMJD3 Assay
Temperature298.15±n/a K
IC50 5500±n/a nM
Commentsextracted
Citation Boloor, AChen, YKWallace, MB Histone demethylase inhibitors US Patent US10106534 Publication Date 10/23/2018
 
Lysine-specific demethylase 6B
Name:Lysine-specific demethylase 6B
Type:Protein
Mol. Mass.:176672.55
Organism:Homo sapiens (Human)
Description:O15054
Residue:1643
BDBM293843
NameBDBM293843
Synonyms:3-({[(1R)-6-[(4-ethoxyphenyl)(methyl)amino]-1,2,3,4- | US10106534, Example 185
TypeSmall organic molecule
Emp. Form.C26H29N3O3
Mol. Mass.431.5268
SMILESCCOc1ccc(cc1)N(C)c1ccc2[C@H](CNc3cnccc3C(O)=O)CCCc2c1