Reaction Details
TargetLysine-specific demethylase 6B
LigandBDBM293845
Substrate/Competitorn/a
Meas. Tech.JMJD3 Assay
Temperature298.15±n/a K
IC50 5500±n/a nM
Commentsextracted
Citation Boloor, AChen, YKWallace, MB Histone demethylase inhibitors US Patent US10106534 Publication Date 10/23/2018
 
Lysine-specific demethylase 6B
Name:Lysine-specific demethylase 6B
Type:Protein
Mol. Mass.:176672.55
Organism:Homo sapiens (Human)
Description:O15054
Residue:1643
BDBM293845
NameBDBM293845
Synonyms:3-({[(4R)-7-{methyl[4-(propan-2-yl)phenyl]amino}-3,4-dihydro- | US10106534, Example 187
TypeSmall organic molecule
Emp. Form.C26H29N3O3
Mol. Mass.431.5268
SMILESCC(C)c1ccc(cc1)N(C)c1ccc2[C@H](CNc3cnccc3C(O)=O)CCOc2c1