Reaction Details
TargetE3 ubiquitin-protein ligase SMURF1 [420-757]
LigandBDBM239096
Substrate/Competitorn/a
Meas. Tech.Biochemical Assay
Temperature298.15±n/a K
IC50 6±n/a nM
Commentsextracted
Citation Bala, KJBrearley, ADale, JEdwards, AAhmed, MPorter, DPulz, RARooney, LASandham, DAShaw, DSmith, NTaylor, JLTaylor, RJTroxler, TJWrigglesworth, J Carboxamide derivatives US Patent US9403810 Publication Date 8/2/2016
 
E3 ubiquitin-protein ligase SMURF1 [420-757]
Name:E3 ubiquitin-protein ligase SMURF1 [420-757]
Type:Enzyme
Mol. Mass.:39188.96
Organism:Homo sapiens (Human)
Description:HECTdomain amino acid 420-757
Residue:338
BDBM239096
NameBDBM239096
Synonyms:US10195181, Example 1.5 | US9403810, 1.5
TypeSmall organic molecule
Emp. Form.C23H32N4O3
Mol. Mass.412.5252
SMILESCC1CCC(=CC1)c1onc(C(=O)Nc2c(C)n(C)n(C3CCCCC3)c2=O)c1C