Reaction Details
TargetE3 ubiquitin-protein ligase SMURF1 [420-757]
LigandBDBM239099
Substrate/Competitorn/a
Meas. Tech.Biochemical Assay
Temperature298.15±n/a K
IC50 2.5±n/a nM
Commentsextracted
Citation Bala, KJBrearley, ADale, JEdwards, AAhmed, MPorter, DPulz, RARooney, LASandham, DAShaw, DSmith, NTaylor, JLTaylor, RJTroxler, TJWrigglesworth, J Carboxamide derivatives US Patent US9403810 Publication Date 8/2/2016
 
E3 ubiquitin-protein ligase SMURF1 [420-757]
Name:E3 ubiquitin-protein ligase SMURF1 [420-757]
Type:Enzyme
Mol. Mass.:39188.96
Organism:Homo sapiens (Human)
Description:HECTdomain amino acid 420-757
Residue:338
BDBM239099
NameBDBM239099
Synonyms:US10195181, Example 2 | US9403810, 2
TypeSmall organic molecule
Emp. Form.C26H36N4O3
Mol. Mass.452.589
SMILESCc1c(noc1C1=CCC2(CCCC2)CC1)C(=O)Nc1c(C)n(C)n(C2CCCCC2)c1=O