Reaction Details
TargetE3 ubiquitin-protein ligase SMURF1 [420-757]
LigandBDBM239120
Substrate/Competitorn/a
Meas. Tech.Biochemical Assay
Temperature298.15±n/a K
IC50 74±n/a nM
Commentsextracted
Citation Bala, KJBrearley, ADale, JEdwards, AAhmed, MPorter, DPulz, RARooney, LASandham, DAShaw, DSmith, NTaylor, JLTaylor, RJTroxler, TJWrigglesworth, J Carboxamide derivatives US Patent US9403810 Publication Date 8/2/2016
 
E3 ubiquitin-protein ligase SMURF1 [420-757]
Name:E3 ubiquitin-protein ligase SMURF1 [420-757]
Type:Enzyme
Mol. Mass.:39188.96
Organism:Homo sapiens (Human)
Description:HECTdomain amino acid 420-757
Residue:338
BDBM239120
NameBDBM239120
Synonyms:US9403810, 25d
TypeSmall organic molecule
Emp. Form.C23H34N4O5
Mol. Mass.446.5399
SMILESCc1c(onc1C(=O)Nc1c(C)n(C)n(C2CCCCC2)c1=O)[C@H]1OC[C@@H](O1)C(C)(C)C