Reaction Details
TargetHistone deacetylase 4
LigandBDBM293878
Substrate/Competitorn/a
Meas. Tech.Biochemical HDAC-4 Assay
IC50 20.0±n/a nM
Citation Dominguez, CMuñoz-Sanjuán, IMaillard, MLuckhurst, CAJarvis, REBürli, RWAllen, DRHaughan, AFBreccia, PVater, HDStott, AJPenrose, SDWall, MSaville-Stones, EAWishart, GHughes, SJ Histone deacetylase inhibitors and compositions and methods of use thereof US Patent US10106535 Publication Date 10/23/2018
 
Histone deacetylase 4
Name:Histone deacetylase 4
Type:Enzyme
Mol. Mass.:119049.39
Organism:Homo sapiens (Human)
Description:P56524
Residue:1084
BDBM293878
NameBDBM293878
Synonyms:(S)-1-(3-Fluoro-2- methylphenyl)-N- hydroxy-3-(o- tolyl)cyclopent-2- enecarboxamide US9617259, 4
TypeSmall organic molecule
Emp. Form.C20H20FNO2
Mol. Mass.325.3767
SMILESCc1ccccc1C1=C[C@](CC1)(C(=O)NO)c1cccc(F)c1C