Reaction Details
TargetHistone deacetylase 1
LigandBDBM50398723
Substrate/Competitorn/a
Meas. Tech.Inhibition Assay
pH8±n/a
IC50 1690±120 nM
Commentsextracted
Citation Sotomayor, EMBergman, JKozikowski, AWoan, KVVillagra, AV Selective histone deactylase 6 inhibitors US Patent US9409858 Publication Date 8/9/2016
 
Histone deacetylase 1
Name:Histone deacetylase 1
Type:Enzyme
Mol. Mass.:55090.27
Organism:Homo sapiens (Human)
Description:Q13547
Residue:482
BDBM50398723
NameBDBM50398723
Synonyms:CHEMBL2179615 US9409858, 5d US9956192, Compound 5d
TypeSmall organic molecule
Emp. Form.C24H25N3O5
Mol. Mass.435.4724
SMILESCOc1ccccc1NC(=O)N(CCc1ccc(O)cc1)Cc1ccc(cc1)C(=O)NO