Reaction Details
TargetHistone deacetylase 1
LigandBDBM50398719
Substrate/Competitorn/a
Meas. Tech.Inhibition Assay
pH8±n/a
IC50 8120±600 nM
Commentsextracted
Citation Sotomayor, EMBergman, JKozikowski, AWoan, KVVillagra, AV Selective histone deactylase 6 inhibitors US Patent US9409858 Publication Date 8/9/2016
 
Histone deacetylase 1
Name:Histone deacetylase 1
Type:Enzyme
Mol. Mass.:55090.27
Organism:Homo sapiens (Human)
Description:Q13547
Residue:482
BDBM50398719
NameBDBM50398719
Synonyms:CHEMBL2179244 US9409858, 8a US9956192, Compound 8a
TypeSmall organic molecule
Emp. Form.C19H23N3O3
Mol. Mass.341.4042
SMILESCCCCN(C(=O)NCc1ccc(cc1)C(=O)NO)c1ccccc1