Reaction Details
TargetHistone deacetylase 6
LigandBDBM239064
Substrate/Competitorn/a
Meas. Tech.Inhibition Assay
pH8±n/a
IC50 25.6±n/a nM
Commentsextracted
Citation Sotomayor, EMBergman, JKozikowski, AWoan, KVVillagra, AV Selective histone deactylase 6 inhibitors US Patent US9409858 Publication Date 8/9/2016
 
Histone deacetylase 6
Name:Histone deacetylase 6
Type:Chromatin regulator; hydrolase; repressor
Mol. Mass.:131381.51
Organism:Homo sapiens (Human)
Description:Q9UBN7
Residue:1215
BDBM239064
NameBDBM239064
Synonyms:US10227295, Compound 11a US9956192, Compound 11a
TypeSmall organic molecule
Emp. Form.C18H17N3O4
Mol. Mass.339.3453
SMILESONC(=O)c1ccc(CN2C(=O)N[C@@H](Cc3ccccc3)C2=O)cc1