Reaction Details
TargetCannabinoid receptor 1
LigandBDBM60992
Substrate/Competitorn/a
Meas. Tech.Competition Receptor Binding Assay
Temperature298.15±n/a K
Ki 1280±470 nM
Commentsextracted
Citation Prather, PLPrisinzano, TEFantegrossi, WEBrents, LKMoran, JRadominska-Pandya, AVasiljevik, T Use of the aminoalkylindole JWH-073-M4 and related compounds as neutral CB1 receptor antagonists for the treatment of alcoholism, drug abuse, obesity, and obesity-related diseases US Patent US9416103 Publication Date 8/16/2016
 
Cannabinoid receptor 1
Name:Cannabinoid receptor 1
Type:Enzyme
Mol. Mass.:52842.52
Organism:Mus musculus (Mouse)
Description:P47746
Residue:473
BDBM60992
NameBDBM60992
Synonyms:US9416103, JWH-073-M3
Typen/a
Emp. Form.C23H21NO2
Mol. Mass.343.4183
SMILESCCCCn1cc(C(=O)c2cccc3ccccc23)c2ccc(O)cc12