Reaction Details
TargetCannabinoid receptor 1
LigandBDBM85804
Substrate/Competitorn/a
Meas. Tech.Competition Receptor Binding Assay
Temperature298.15±n/a K
Ki 12.9±3.4 nM
Commentsextracted
Citation Prather, PLPrisinzano, TEFantegrossi, WEBrents, LKMoran, JRadominska-Pandya, AVasiljevik, T Use of the aminoalkylindole JWH-073-M4 and related compounds as neutral CB1 receptor antagonists for the treatment of alcoholism, drug abuse, obesity, and obesity-related diseases US Patent US9416103 Publication Date 8/16/2016
 
Cannabinoid receptor 1
Name:Cannabinoid receptor 1
Type:Enzyme
Mol. Mass.:52842.52
Organism:Mus musculus (Mouse)
Description:P47746
Residue:473
BDBM85804
NameBDBM85804
Synonyms:1-Naphthyl(1-butyl-1H-indole-3-yl)methanone US9416103, JWH-073
TypeSmall organic molecule
Emp. Form.C23H21NO
Mol. Mass.327.4189
SMILESCCCCn1cc(C(=O)c2cccc3ccccc23)c2ccccc12