Reaction Details
TargetBeta-carbonic anhydrase 1
LigandBDBM11627
Substrate/Competitorn/a
Meas. Tech.CA Inhibition Assay
pH8.3±0
Temperature298.15±0 K
Ki 1.2e+2±n/a nM
Citation Maresca, AScozzafava, AVullo, DSupuran, CT Dihalogenated sulfanilamides and benzolamides are effective inhibitors of the three ß-class carbonic anhydrases from Mycobacterium tuberculosis. J Enzyme Inhib Med Chem28:384-7 (2013) 
 
Beta-carbonic anhydrase 1
Name:Beta-carbonic anhydrase 1
Type:Enzyme
Mol. Mass.:18186.06
Organism:Mycobacterium tuberculosis
Description:The recombinant GST-mtCA1 construct was cloned, expressed, and further purified from E. coli. The purified protein was used in inhibition assays.
Residue:163
BDBM11627
NameBDBM11627
Synonyms:β-CA inhibitor, 3 5-{[(4-amino-3-fluoro-5-iodophenyl)sulfonyl]amino}-1,3,4-thiadiazole-2-sulfonamide | aminobenzolamide 20
TypeSmall organic molecule
Emp. Form.C8H7FIN5O4S3
Mol. Mass.479.27
SMILESNc1c(F)cc(cc1I)S(=O)(=O)Nc1nnc(s1)S(N)(=O)=O