Reaction Details
TargetBeta-carbonic anhydrase 1
LigandBDBM11611
Substrate/Competitorn/a
Meas. Tech.CA Inhibition Assay
pH8.3±0
Temperature298.15±0 K
Ki 4.1e+2±n/a nM
Citation Maresca, AScozzafava, AVullo, DSupuran, CT Dihalogenated sulfanilamides and benzolamides are effective inhibitors of the three ß-class carbonic anhydrases from Mycobacterium tuberculosis. J Enzyme Inhib Med Chem28:384-7 (2013) 
 
Beta-carbonic anhydrase 1
Name:Beta-carbonic anhydrase 1
Type:Enzyme
Mol. Mass.:18186.06
Organism:Mycobacterium tuberculosis
Description:The recombinant GST-mtCA1 construct was cloned, expressed, and further purified from E. coli. The purified protein was used in inhibition assays.
Residue:163
BDBM11611
NameBDBM11611
Synonyms:β-CA inhibitor, 10 4-amino-3,5-dibromobenzene-1-sulfonamide halogenosulfanilamide deriv. 12
TypeSmall organic molecule
Emp. Form.C6H6Br2N2O2S
Mol. Mass.329.997
SMILESNc1c(Br)cc(cc1Br)S(N)(=O)=O