Reaction Details
TargetCannabinoid receptor 1
LigandBDBM239148
Substrate/Competitorn/a
Meas. Tech.Cannabinoid Receptor Binding Assay
Ki>1.0e+4±n/a nM
IC50>1.0e+4±n/a nM
Citation Taher, ATKadry, HHAllarà, MDi Marzo, VAbadi, AHAbouzid, KA Synthesis and binding study of certain 6-arylalkanamides as molecular probes for cannabinoid receptor subtypes. J Enzyme Inhib Med Chem28:436-9 (2013) 
 
Cannabinoid receptor 1
Name:Cannabinoid receptor 1
Type:G Protein-Coupled Receptor (GPCR)
Mol. Mass.:52868.96
Organism:Homo sapiens (Human)
Description:P21554
Residue:472
BDBM239148
NameBDBM239148
Synonyms:(E)-6-(4-(Benzyloxy)phenyl)-N-(2-hydroxybutan-2-yl)-4-oxohex-5-enamide (3j)
TypeSmall organic molecule
Emp. Form.C23H27NO4
Mol. Mass.381.4648
SMILESCCC(C)(O)NC(=O)CCC(=O)\C=C\c1ccc(OCc2ccccc2)cc1