Reaction Details
TargetCannabinoid receptor 1
LigandBDBM239152
Substrate/Competitorn/a
Meas. Tech.Cannabinoid Receptor Binding Assay
Ki>1.0e+4±n/a nM
IC50>1.0e+4±n/a nM
Citation Taher, ATKadry, HHAllarà, MDi Marzo, VAbadi, AHAbouzid, KA Synthesis and binding study of certain 6-arylalkanamides as molecular probes for cannabinoid receptor subtypes. J Enzyme Inhib Med Chem28:436-9 (2013) 
 
Cannabinoid receptor 1
Name:Cannabinoid receptor 1
Type:G Protein-Coupled Receptor (GPCR)
Mol. Mass.:52868.96
Organism:Homo sapiens (Human)
Description:P21554
Residue:472
BDBM239152
NameBDBM239152
Synonyms:N-(2-Hydroxybutan-2-yl)-2-(4-naphthalen-1-ylamino)-4-oxobutanamide (5a)
TypeSmall organic molecule
Emp. Form.C18H22N2O3
Mol. Mass.314.3789
SMILESCCC(C)(O)NC(=O)CCC(=O)Nc1cccc2ccccc12