Reaction Details
TargetCannabinoid receptor 2
LigandBDBM239146
Substrate/Competitorn/a
Meas. Tech.Cannabinoid Receptor Binding Assay
Ki>1.0e+4±n/a nM
IC50>1.0e+4±n/a nM
Citation Taher, ATKadry, HHAllarà, MDi Marzo, VAbadi, AHAbouzid, KA Synthesis and binding study of certain 6-arylalkanamides as molecular probes for cannabinoid receptor subtypes. J Enzyme Inhib Med Chem28:436-9 (2013) 
 
Cannabinoid receptor 2
Name:Cannabinoid receptor 2
Type:G Protein-Coupled Receptor (GPCR)
Mol. Mass.:39690.94
Organism:Homo sapiens (Human)
Description:P34972
Residue:360
BDBM239146
NameBDBM239146
Synonyms:(E)-Ethyl 2-(6-(3,4-dimethoxyphenyl)-4-oxohex-5-enamido)acetate (3h)
TypeSmall organic molecule
Emp. Form.C18H23NO6
Mol. Mass.349.3783
SMILESCCOC(=O)CNC(=O)CCC(=O)\C=C\c1ccc(OC)c(OC)c1