Reaction Details
TargetCannabinoid receptor 2
LigandBDBM239147
Substrate/Competitorn/a
Meas. Tech.Cannabinoid Receptor Binding Assay
Ki>1.0e+4±n/a nM
IC50>1.0e+4±n/a nM
Citation Taher, ATKadry, HHAllarà, MDi Marzo, VAbadi, AHAbouzid, KA Synthesis and binding study of certain 6-arylalkanamides as molecular probes for cannabinoid receptor subtypes. J Enzyme Inhib Med Chem28:436-9 (2013) 
 
Cannabinoid receptor 2
Name:Cannabinoid receptor 2
Type:G Protein-Coupled Receptor (GPCR)
Mol. Mass.:39690.94
Organism:Homo sapiens (Human)
Description:P34972
Residue:360
BDBM239147
NameBDBM239147
Synonyms:(E)-6-(3,4-Dimethoxyphenyl)-N-(2-hydroxybutan-2-yl)-4-oxohex-5-enamide (3i)
TypeSmall organic molecule
Emp. Form.C18H25NO5
Mol. Mass.335.3948
SMILESCCC(C)(O)NC(=O)CCC(=O)\C=C\c1ccc(OC)c(OC)c1