Reaction Details
TargetCannabinoid receptor 2
LigandBDBM239151
Substrate/Competitorn/a
Meas. Tech.Cannabinoid Receptor Binding Assay
Ki>1.0e+4±n/a nM
IC50>1.0e+4±n/a nM
Citation Taher, ATKadry, HHAllarà, MDi Marzo, VAbadi, AHAbouzid, KA Synthesis and binding study of certain 6-arylalkanamides as molecular probes for cannabinoid receptor subtypes. J Enzyme Inhib Med Chem28:436-9 (2013) 
 
Cannabinoid receptor 2
Name:Cannabinoid receptor 2
Type:G Protein-Coupled Receptor (GPCR)
Mol. Mass.:39690.94
Organism:Homo sapiens (Human)
Description:P34972
Residue:360
BDBM239151
NameBDBM239151
Synonyms:(E)-6-(Biphenyl-4-yl)-N-(2-hydroxybutan-2-yl)-4-oxohex-5-enamide (3m)
TypeSmall organic molecule
Emp. Form.C22H25NO3
Mol. Mass.351.4388
SMILESCCC(C)(O)NC(=O)CCC(=O)\C=C\c1ccc(cc1)-c1ccccc1