Reaction Details
TargetCarbonic anhydrase 2
LigandBDBM19461
Substrate/Competitorn/a
Meas. Tech.Esterase Activity Assay
pH7.4±n/a
Ki 113±n/a nM
Commentsextracted
Citation Koz, Ã¿Ekinci, DPerrone, APiacente, SAlankus-Çaliskan, Ã¿Bedir, ESupuran, CT Analysis of saponins and phenolic compounds as inhibitors of a-carbonic anhydrase isoenzymes. J Enzyme Inhib Med Chem28:412-7 (2013) 
 
Carbonic anhydrase 2
Name:Carbonic anhydrase 2
Type:Enzyme
Mol. Mass.:29250.71
Organism:Homo sapiens (Human)
Description:P00918
Residue:260
BDBM19461
NameBDBM19461
Synonyms:α-CA inhibitor, 5 CHEMBL32571 Naringenin (NAR) salipurpol
TypeEstrgen Antagonist
Emp. Form.C15H12O5
Mol. Mass.272.2528
SMILESOc1ccc(cc1)C1CC(=O)c2c(O)cc(O)cc2O1