Reaction Details
TargetCarbonic anhydrase 2
LigandBDBM239160
Substrate/Competitorn/a
Meas. Tech.Esterase Activity Assay
pH7.4±n/a
Ki 9.7e+2±n/a nM
Commentsextracted
Citation Koz, Ã¿Ekinci, DPerrone, APiacente, SAlankus-Çaliskan, Ã¿Bedir, ESupuran, CT Analysis of saponins and phenolic compounds as inhibitors of a-carbonic anhydrase isoenzymes. J Enzyme Inhib Med Chem28:412-7 (2013) 
 
Carbonic anhydrase 2
Name:Carbonic anhydrase 2
Type:Enzyme
Mol. Mass.:29250.71
Organism:Homo sapiens (Human)
Description:P00918
Residue:260
BDBM239160
NameBDBM239160
Synonyms:α-CA inhibitor, 8
TypeSmall organic molecule
Emp. Form.C41H68O14
Mol. Mass.784.9702
SMILESCC(C)(O)[C@@H]1CC[C@@](C)(O1)[C@H]1[C@@H](O)C[C@@]2(C)C3C[C@H](O[C@@H]4OC(CO)[C@@H](O)C(O)[C@@H]4O)C4[C@]5(C[C@@]35CC[C@]12C)CC[C@H](O[C@@H]1OC[C@@H](O)C(O)[C@@H]1O)C4(C)C