Reaction Details
TargetCarbonic anhydrase 3
LigandBDBM239161
Substrate/Competitorn/a
Meas. Tech.Esterase Activity Assay
pH7.4±n/a
Ki 2.18e+3±n/a nM
Commentsextracted
Citation Koz, Ã¿Ekinci, DPerrone, APiacente, SAlankus-Çaliskan, Ã¿Bedir, ESupuran, CT Analysis of saponins and phenolic compounds as inhibitors of a-carbonic anhydrase isoenzymes. J Enzyme Inhib Med Chem28:412-7 (2013) 
 
Carbonic anhydrase 3
Name:Carbonic anhydrase 3
Type:Enzyme
Mol. Mass.:29376.92
Organism:Bos taurus (Cattle)
Description:Q3SZX4
Residue:260
BDBM239161
NameBDBM239161
Synonyms:α-CA inhibitor, 9
TypeSmall organic molecule
Emp. Form.C46H74O18
Mol. Mass.915.069
SMILESCC1(C)C[C@@H](O)[C@]2(C)CC[C@]3(C)C(=CCC4[C@@]5(C)CC[C@H](O[C@@H]6OC([C@@H](O)C(O)[C@@H]6O[C@@H]6OC[C@@H](O)[C@H](O)C6O[C@@H]6OC(O)[C@H](O)[C@H](O)C6O)C(O)=O)[C@](C)(CO)C5CC[C@@]34C)C2C1