Reaction Details
TargetCarbonic anhydrase 3
LigandBDBM239162
Substrate/Competitorn/a
Meas. Tech.Esterase Activity Assay
pH7.4±n/a
Ki 2.49e+3±n/a nM
Commentsextracted
Citation Koz, Ã¿Ekinci, DPerrone, APiacente, SAlankus-Çaliskan, Ã¿Bedir, ESupuran, CT Analysis of saponins and phenolic compounds as inhibitors of a-carbonic anhydrase isoenzymes. J Enzyme Inhib Med Chem28:412-7 (2013) 
 
Carbonic anhydrase 3
Name:Carbonic anhydrase 3
Type:Enzyme
Mol. Mass.:29376.92
Organism:Bos taurus (Cattle)
Description:Q3SZX4
Residue:260
BDBM239162
NameBDBM239162
Synonyms:α-CA inhibitor, 10
TypeSmall organic molecule
Emp. Form.C40H66O13
Mol. Mass.754.9442
SMILESCC(C)(O)[C@@H]1CC[C@@](C)(O1)[C@H]1[C@@H](O)C[C@@]2(C)C3C[C@H](O[C@@H]4OC[C@@H](O)C(O)[C@@H]4O)C4[C@]5(C[C@@]35CC[C@]12C)CC[C@H](O[C@@H]1OC[C@@H](O)C(O)[C@@H]1O)C4(C)C