Reaction Details
TargetCarbonic anhydrase 3
LigandBDBM26188
Substrate/Competitorn/a
Meas. Tech.Esterase Activity Assay
pH7.4±n/a
Ki 5.79e+3±n/a nM
Commentsextracted
Citation Koz, Ã¿Ekinci, DPerrone, APiacente, SAlankus-Çaliskan, Ã¿Bedir, ESupuran, CT Analysis of saponins and phenolic compounds as inhibitors of a-carbonic anhydrase isoenzymes. J Enzyme Inhib Med Chem28:412-7 (2013) 
 
Carbonic anhydrase 3
Name:Carbonic anhydrase 3
Type:Enzyme
Mol. Mass.:29376.92
Organism:Bos taurus (Cattle)
Description:Q3SZX4
Residue:260
BDBM26188
NameBDBM26188
Synonyms:α-CA inhibitor, 12 1,2-dihydroxybenzene benzene-1,2-diol | phenol derivative, 2
TypeSmall organic molecule
Emp. Form.C6H6O2
Mol. Mass.110.1106
SMILESOc1ccccc1O