Reaction Details
TargetCarbonic anhydrase 4
LigandBDBM239161
Substrate/Competitorn/a
Meas. Tech.Esterase Activity Assay
pH7.4±n/a
Ki 3.94e+3±n/a nM
Commentsextracted
Citation Koz, Ã¿Ekinci, DPerrone, APiacente, SAlankus-Çaliskan, Ã¿Bedir, ESupuran, CT Analysis of saponins and phenolic compounds as inhibitors of a-carbonic anhydrase isoenzymes. J Enzyme Inhib Med Chem28:412-7 (2013) 
 
Carbonic anhydrase 4
Name:Carbonic anhydrase 4
Type:Enzyme
Mol. Mass.:35037.98
Organism:Homo sapiens (Human)
Description:P22748
Residue:312
BDBM239161
NameBDBM239161
Synonyms:α-CA inhibitor, 9
TypeSmall organic molecule
Emp. Form.C46H74O18
Mol. Mass.915.069
SMILESCC1(C)C[C@@H](O)[C@]2(C)CC[C@]3(C)C(=CCC4[C@@]5(C)CC[C@H](O[C@@H]6OC([C@@H](O)C(O)[C@@H]6O[C@@H]6OC[C@@H](O)[C@H](O)C6O[C@@H]6OC(O)[C@H](O)[C@H](O)C6O)C(O)=O)[C@](C)(CO)C5CC[C@@]34C)C2C1