Reaction Details
TargetMu-type opioid receptor
LigandBDBM239911
Substrate/Competitorn/a
Meas. Tech.Binding Assay
Temperature298.15±n/a K
Ki 0.4±n/a nM
Commentsextracted
Citation Nolte, BSchröder, WLinz, KEnglberger, WSchick, HGraubaum, HBraun, BOzegowski, SBálint, JSonnenschein, H Substituted 4-aminocyclohexane derivatives US Patent US9403767 Publication Date 8/2/2016
 
Mu-type opioid receptor
Name:Mu-type opioid receptor
Type:G Protein-Coupled Receptor (GPCR)
Mol. Mass.:44789.51
Organism:Homo sapiens (Human)
Description:P35372
Residue:400
BDBM239911
NameBDBM239911
Synonyms:US9403767, 76 | US9403767, 77
TypeSmall organic molecule
Emp. Form.C25H33N3
Mol. Mass.375.5496
SMILESCN(CC1(C)CCC(CC1)(N(C)C)c1ccccc1)c1c[nH]c2ccccc12