Reaction Details
TargetMitotic checkpoint serine/threonine-protein kinase BUB1 [704-1085]
LigandBDBM162088
Substrate/Competitorn/a
Meas. Tech.Bub1 Kinase Assay
pH8±n/a
IC50 3800±n/a nM
Commentsextracted
Citation Bärfacker, LPrechtl, SSiemeister, GWengner, AMAckerstaff, JNowak-Reppel, KBader, BLienau, PStöckigt, DHeinrich, T Amino-substituted isothiazoles US Patent US9682995 Publication Date 6/20/2017
 
Mitotic checkpoint serine/threonine-protein kinase BUB1 [704-1085]
Name:Mitotic checkpoint serine/threonine-protein kinase BUB1 [704-1085]
Type:n/a
Mol. Mass.:43624.72
Organism:Homo sapiens (Human)
Description:O43683[704-1085]
Residue:382
BDBM162088
NameBDBM162088
Synonyms:US9682995, 11
TypeSmall organic molecule
Emp. Form.C20H18N4O2S
Mol. Mass.378.448
SMILESCCc1ccccc1NC(=O)c1c(C)nsc1Nc1nc2ccccc2o1