Reaction Details
TargetCalpain-1 catalytic subunit
LigandBDBM240262
Substrate/Competitorn/a
Meas. Tech.Inhibition Kinetics Assay
pH7.6±n/a
Temperature303.15±n/a K
Ki 2600±n/a nM
Commentsextracted
Citation Thatcher, GRSchiefer, ITArancio, OMauro, F Cysteine protease inhibitors and uses thereof US Patent US9403843 Publication Date 8/2/2016
 
Calpain-1 catalytic subunit
Name:Calpain-1 catalytic subunit
Type:Catalytic subunit; forms a heterodimer with a small (regulatory) subunit (CAPNS1)
Mol. Mass.:81729.82
Organism:Sus scrofa (pig)
Description:Native calpain-1 from porcine erythrocytes, purchased from Calbiochem, was used in assay.
Residue:714
BDBM240262
NameBDBM240262
Synonyms:US9403843, 33
TypeSmall organic molecule
Emp. Form.C19H15FN4O5S2
Mol. Mass.462.475
SMILESOC(=O)[C@@H]1O[C@H]1C(=O)N[C@@H](Cc1cscn1)C(=O)Nc1nc(cs1)-c1ccc(F)cc1