Reaction Details
TargetCannabinoid receptor 2
LigandBDBM240321
Substrate/Competitorn/a
Meas. Tech.cAMP Assay
Temperature310.15±n/a K
EC50 51.7±n/a nM
Commentsextracted
Citation Grether, UKimbara, ANettekoven, MRicklin, FRoever, SRogers-Evans, MRombach, DSchulz-Gasch, TWestphal, M Pyridine-2-amides useful as CB2 agonists US Patent US9409866 Publication Date 8/9/2016
 
Cannabinoid receptor 2
Name:Cannabinoid receptor 2
Type:G Protein-Coupled Receptor (GPCR)
Mol. Mass.:39690.94
Organism:Homo sapiens (Human)
Description:P34972
Residue:360
BDBM240321
NameBDBM240321
Synonyms:US9409866, 36
TypeSmall organic molecule
Emp. Form.C16H16ClN3O4
Mol. Mass.349.769
SMILESClc1cnc(cc1OCC1CC1)C(=O)NC1(COC1)c1ncco1