Reaction Details
TargetCannabinoid receptor 2
LigandBDBM240326
Substrate/Competitorn/a
Meas. Tech.cAMP Assay
Temperature310.15±n/a K
EC50 3.3±n/a nM
Commentsextracted
Citation Grether, UKimbara, ANettekoven, MRicklin, FRoever, SRogers-Evans, MRombach, DSchulz-Gasch, TWestphal, M Pyridine-2-amides useful as CB2 agonists US Patent US9409866 Publication Date 8/9/2016
 
Cannabinoid receptor 2
Name:Cannabinoid receptor 2
Type:G Protein-Coupled Receptor (GPCR)
Mol. Mass.:39690.94
Organism:Homo sapiens (Human)
Description:P34972
Residue:360
BDBM240326
NameBDBM240326
Synonyms:US9409866, 41
TypeSmall organic molecule
Emp. Form.C20H14ClF4N3O
Mol. Mass.423.791
SMILESFc1ccc(Cc2cc(ncc2Cl)C(=O)N[C@@H](c2cccnc2)C(F)(F)F)cc1