Reaction Details
TargetCannabinoid receptor 2
LigandBDBM240334
Substrate/Competitorn/a
Meas. Tech.cAMP Assay
Temperature310.15±n/a K
EC50 1.7±n/a nM
Commentsextracted
Citation Grether, UKimbara, ANettekoven, MRicklin, FRoever, SRogers-Evans, MRombach, DSchulz-Gasch, TWestphal, M Pyridine-2-amides useful as CB2 agonists US Patent US9409866 Publication Date 8/9/2016
 
Cannabinoid receptor 2
Name:Cannabinoid receptor 2
Type:G Protein-Coupled Receptor (GPCR)
Mol. Mass.:39690.94
Organism:Homo sapiens (Human)
Description:P34972
Residue:360
BDBM240334
NameBDBM240334
Synonyms:US9409866, 49
TypeSmall organic molecule
Emp. Form.C19H21F3N4O3
Mol. Mass.410.3902
SMILESCc1nc(no1)C(C)(NC(=O)c1cc(OCC(F)(F)F)c(cn1)C1CC1)C1CC1