Reaction Details
TargetProtein mono-ADP-ribosyltransferase PARP3 [R100H]
LigandBDBM240713
Substrate/Competitorn/a
Meas. Tech.Biochemical Assay
Kd 20±n/a nM
Citation Papeo, GMCirla, AD'Anello, MScolaro, AZuccotto, F 3-phenyl-isoquinolin-1(2H)-one derivatives as PARP-1 inhibitors US Patent US9422243 Publication Date 8/23/2016
 
Protein mono-ADP-ribosyltransferase PARP3 [R100H]
Name:Protein mono-ADP-ribosyltransferase PARP3 [R100H]
Type:PROTEIN
Mol. Mass.:60071.85
Organism:Homo sapiens (Human)
Description:Q9Y6F1[R100H]
Residue:533
BDBM240713
NameBDBM240713
Synonyms:US9422243, 11
TypeSmall organic molecule
Emp. Form.C18H14FN3O2
Mol. Mass.323.3211
SMILESNCCOc1c([nH]c(=O)c2cc(F)ccc12)-c1cccc(c1)C#N