Reaction Details
TargetPoly [ADP-ribose] polymerase 1
LigandBDBM240715
Substrate/Competitorn/a
Meas. Tech.PAR Assay
Temperature310.15±n/a K
IC50 0.2±n/a nM
Commentsextracted
Citation Papeo, GMCirla, AD'Anello, MScolaro, AZuccotto, F 3-phenyl-isoquinolin-1(2H)-one derivatives as PARP-1 inhibitors US Patent US9422243 Publication Date 8/23/2016
 
Poly [ADP-ribose] polymerase 1
Name:Poly [ADP-ribose] polymerase 1
Type:n/a
Mol. Mass.:113114.22
Organism:Homo sapiens (Human)
Description:P09874
Residue:1014
BDBM240715
NameBDBM240715
Synonyms:US9422243, 13
TypeSmall organic molecule
Emp. Form.C18H16ClFN2O2
Mol. Mass.346.783
SMILESCc1cc(ccc1Cl)-c1[nH]c(=O)c2cc(F)ccc2c1OCCN