Reaction Details
TargetEukaryotic elongation factor 2 kinase
LigandBDBM293954
Substrate/Competitorn/a
Meas. Tech.Kinase-Glo luminescent kinase assay
IC50 700±n/a nM
Citation Dodd, JH Compounds inhibiting eukaryotic elongation factor 2 kinase activity US Patent US10106552 Publication Date 10/23/2018
 
Eukaryotic elongation factor 2 kinase
Name:Eukaryotic elongation factor 2 kinase
Type:Protein
Mol. Mass.:82116.99
Organism:Homo sapiens (Human)
Description:n/a
Residue:725
BDBM293954
NameBDBM293954
Synonyms:US10106552, Compound 29
TypeSmall organic molecule
Emp. Form.C17H19N5OS
Mol. Mass.341.431
SMILESCn1cc(cn1)-c1c2CCC(C)(C)c2nc2sc(C(N)=O)c(N)c12