Reaction Details
TargetEukaryotic elongation factor 2 kinase
LigandBDBM293960
Substrate/Competitorn/a
Meas. Tech.Kinase-Glo luminescent kinase assay
IC50 400±n/a nM
Citation Dodd, JH Compounds inhibiting eukaryotic elongation factor 2 kinase activity US Patent US10106552 Publication Date 10/23/2018
 
Eukaryotic elongation factor 2 kinase
Name:Eukaryotic elongation factor 2 kinase
Type:Protein
Mol. Mass.:82116.99
Organism:Homo sapiens (Human)
Description:n/a
Residue:725
BDBM293960
NameBDBM293960
Synonyms:US10106552, Compound 35
TypeSmall organic molecule
Emp. Form.C17H18N4OS2
Mol. Mass.358.481
SMILESCC1(C)CCc2c(C1)nc1sc(C(N)=O)c(N)c1c2-c1cncs1