Reaction Details
TargetEukaryotic elongation factor 2 kinase
LigandBDBM293961
Substrate/Competitorn/a
Meas. Tech.Kinase-Glo luminescent kinase assay
IC50 400±n/a nM
Citation Dodd, JH Compounds inhibiting eukaryotic elongation factor 2 kinase activity US Patent US10106552 Publication Date 10/23/2018
 
Eukaryotic elongation factor 2 kinase
Name:Eukaryotic elongation factor 2 kinase
Type:Protein
Mol. Mass.:82116.99
Organism:Homo sapiens (Human)
Description:n/a
Residue:725
BDBM293961
NameBDBM293961
Synonyms:US10106552, Compound 36
TypeSmall organic molecule
Emp. Form.C18H20N4OS2
Mol. Mass.372.508
SMILESCC1CC(C)(C)Cc2nc3sc(C(N)=O)c(N)c3c(-c3cncs3)c12