Reaction Details
TargetEukaryotic elongation factor 2 kinase
LigandBDBM293965
Substrate/Competitorn/a
Meas. Tech.Kinase-Glo luminescent kinase assay
IC50 400±n/a nM
Citation Dodd, JH Compounds inhibiting eukaryotic elongation factor 2 kinase activity US Patent US10106552 Publication Date 10/23/2018
 
Eukaryotic elongation factor 2 kinase
Name:Eukaryotic elongation factor 2 kinase
Type:Protein
Mol. Mass.:82116.99
Organism:Homo sapiens (Human)
Description:n/a
Residue:725
BDBM293965
NameBDBM293965
Synonyms:US10106552, Compound 40
TypeSmall organic molecule
Emp. Form.C17H18N4OS2
Mol. Mass.358.481
SMILESCc1ncsc1-c1c2CCC(C)(C)c2nc2sc(C(N)=O)c(N)c12