Reaction Details
TargetGenome polyprotein [2420-3010,S282T]
LigandBDBM240844
Substrate/Competitorn/a
Meas. Tech.HCV Replicon Assay
pH7.5±n/a
Temperature300.15±n/a K
IC50>100000±n/a nM
Commentsextracted
Citation Du, JSofia, MJ 2′-spiro-nucleosides and derivatives thereof useful for treating hepatitis C virus and dengue virus infections US Patent US9394331 Publication Date 7/19/2016
 
Genome polyprotein [2420-3010,S282T]
Name:Genome polyprotein [2420-3010,S282T]
Type:Enzyme
Mol. Mass.:65797.38
Organism:Hepatitis C virus genotype 1b (isolate Con1) (HCV)
Description:S282T
Residue:591
BDBM240844
NameBDBM240844
Synonyms:US9394331, 136 | US9394331, 48
TypeSmall organic molecule
Emp. Form.C11H14N2O6
Mol. Mass.270.2387
SMILESOCC1OC(n2ccc(=O)[nH]c2=O)[C@@]2(CCO2)[C@@H]1O