Reaction Details
TargetDual specificity protein kinase TTK
LigandBDBM241228
Substrate/Competitorn/a
Meas. Tech.Enzyme Inhibition Assay
pH7±n/a
Temperature298.15±n/a K
IC50 61±n/a nM
Commentsextracted
Citation Hoelder, SBlagg, JSolanki, SWoodward, HNaud, SBavetsias, VSheldrake, PInnocenti, PCheung, KJAtrash, B Inhibitor compounds US Patent US9409907 Publication Date 8/9/2016
 
Dual specificity protein kinase TTK
Name:Dual specificity protein kinase TTK
Type:Protein
Mol. Mass.:97086.79
Organism:Homo sapiens (Human)
Description:P33981
Residue:857
BDBM241228
NameBDBM241228
Synonyms:US10479788, Example 70 US9409907, 70
TypeSmall organic molecule
Emp. Form.C25H29N7O
Mol. Mass.443.5441
SMILESCOc1cc(ccc1Nc1ncc2ccnc(NCC3CCCCC3)c2n1)-c1cnn(C)c1