Reaction Details
TargetDual specificity protein kinase TTK
LigandBDBM241253
Substrate/Competitorn/a
Meas. Tech.Enzyme Inhibition Assay
pH7±n/a
Temperature298.15±n/a K
IC50 21±n/a nM
Commentsextracted
Citation Hoelder, SBlagg, JSolanki, SWoodward, HNaud, SBavetsias, VSheldrake, PInnocenti, PCheung, KJAtrash, B Inhibitor compounds US Patent US9409907 Publication Date 8/9/2016
 
Dual specificity protein kinase TTK
Name:Dual specificity protein kinase TTK
Type:Protein
Mol. Mass.:97086.79
Organism:Homo sapiens (Human)
Description:P33981
Residue:857
BDBM241253
NameBDBM241253
Synonyms:US11046688, Example 95 | US9409907, 95
TypeSmall organic molecule
Emp. Form.C22H20N8
Mol. Mass.396.4478
SMILESCc1cc(ccc1Nc1ncc2ccnc(-c3cnn(C)c3)c2n1)-c1cnn(C)c1