Reaction Details
TargetDual specificity protein kinase TTK
LigandBDBM241368
Substrate/Competitorn/a
Meas. Tech.Enzyme Inhibition Assay
pH7±n/a
Temperature298.15±n/a K
IC50 3±n/a nM
Commentsextracted
Citation Hoelder, SBlagg, JSolanki, SWoodward, HNaud, SBavetsias, VSheldrake, PInnocenti, PCheung, KJAtrash, B Inhibitor compounds US Patent US9409907 Publication Date 8/9/2016
 
Dual specificity protein kinase TTK
Name:Dual specificity protein kinase TTK
Type:Protein
Mol. Mass.:97086.79
Organism:Homo sapiens (Human)
Description:P33981
Residue:857
BDBM241368
NameBDBM241368
Synonyms:US9409907, 142
TypeSmall organic molecule
Emp. Form.C24H29N7O2
Mol. Mass.447.5328
SMILESCOc1cc(ccc1NC1=Nc2c(N)nccc2CN1C[C@]1(C)CCOC1)-c1cnn(C)c1