Reaction Details
TargetDual specificity protein kinase TTK
LigandBDBM241303
Substrate/Competitorn/a
Meas. Tech.Enzyme Inhibition Assay
pH7±n/a
Temperature298.15±n/a K
IC50 2±n/a nM
Commentsextracted
Citation Hoelder, SBlagg, JSolanki, SWoodward, HNaud, SBavetsias, VSheldrake, PInnocenti, PCheung, KJAtrash, B Inhibitor compounds US Patent US9409907 Publication Date 8/9/2016
 
Dual specificity protein kinase TTK
Name:Dual specificity protein kinase TTK
Type:Protein
Mol. Mass.:97086.79
Organism:Homo sapiens (Human)
Description:P33981
Residue:857
BDBM241303
NameBDBM241303
Synonyms:US10479788, Example 147 US9409907, 147
TypeSmall organic molecule
Emp. Form.C24H29N7O2
Mol. Mass.447.5328
SMILESCOc1cc(ccc1Nc1ncc2ccnc(NCC(C)(C)OC)c2n1)-c1cnn(C)c1C