Reaction Details
TargetCoagulation factor IX
LigandBDBM241400
Substrate/CompetitorUS9409908, pyroGlu-Pro-Arg-pNA
Meas. Tech.In Vitro Assay
pH7.4±n/a
Ki 0.06±n/a nM
Commentsextracted
Citation Yang, WCorte, JRGilligan, PJPinto, DJEwing, WRDilger, AKWang, YFang, TPabbisetty, KBSmith, II, LM Dihydropyridone p1 as factor XIa inhibitors US Patent US9409908 Publication Date 8/9/2016
 
Coagulation factor IX
Name:Coagulation factor IX
Type:Enzyme
Mol. Mass.:51768.83
Organism:Homo sapiens (Human)
Description:P00740
Residue:461
BDBM241400
US9409908, pyroGlu-Pro-Arg-pNA
NameBDBM241400
Synonyms:US9409908, 32 | US9951071, Example 32
TypeSmall organic molecule
Emp. Form.C32H30ClF3N4O5
Mol. Mass.643.053
SMILESCOC(=O)Nc1ccc-2c(NC(=O)[C@H](C)CCC[C@H](N3CCC(=CC3=O)c3c(F)c(Cl)ccc3OC(F)F)c3cc-2ccn3)c1