Reaction Details
TargetCoagulation factor IX
LigandBDBM241410
Substrate/CompetitorUS9409908, pyroGlu-Pro-Arg-pNA
Meas. Tech.In Vitro Assay
pH7.4±n/a
Ki 0.45±n/a nM
Commentsextracted
Citation Yang, WCorte, JRGilligan, PJPinto, DJEwing, WRDilger, AKWang, YFang, TPabbisetty, KBSmith, II, LM Dihydropyridone p1 as factor XIa inhibitors US Patent US9409908 Publication Date 8/9/2016
 
Coagulation factor IX
Name:Coagulation factor IX
Type:Enzyme
Mol. Mass.:51768.83
Organism:Homo sapiens (Human)
Description:P00740
Residue:461
BDBM241410
US9409908, pyroGlu-Pro-Arg-pNA
NameBDBM241410
Synonyms:US9409908, 42 | US9951071, Example 42
TypeSmall organic molecule
Emp. Form.C35H33ClF2N6O5
Mol. Mass.691.124
SMILESCCOC(=O)Cc1nnc(Nc2ccc-3c(NC(=O)[C@H](C)CCC[C@H](N4CCC(=CC4=O)c4c(F)ccc(Cl)c4F)c4cc-3ccn4)c2)o1