Reaction Details
TargetCoagulation factor IX
LigandBDBM241411
Substrate/CompetitorUS9409908, pyroGlu-Pro-Arg-pNA
Meas. Tech.In Vitro Assay
pH7.4±n/a
Ki 0.38±n/a nM
Commentsextracted
Citation Yang, WCorte, JRGilligan, PJPinto, DJEwing, WRDilger, AKWang, YFang, TPabbisetty, KBSmith, II, LM Dihydropyridone p1 as factor XIa inhibitors US Patent US9409908 Publication Date 8/9/2016
 
Coagulation factor IX
Name:Coagulation factor IX
Type:Enzyme
Mol. Mass.:51768.83
Organism:Homo sapiens (Human)
Description:P00740
Residue:461
BDBM241411
US9409908, pyroGlu-Pro-Arg-pNA
NameBDBM241411
Synonyms:US9409908, 43 | US9951071, Example 43
TypeSmall organic molecule
Emp. Form.C32H32BrFN4O4
Mol. Mass.635.523
SMILESCOC(=O)Nc1ccc-2c(NC(=O)[C@H](C)CCC[C@H](N3CCC(=CC3=O)c3c(Br)ccc(C)c3F)c3cc-2ccn3)c1